Compiling errors with AMD

classic Classic list List threaded Threaded
1 message Options
Reply | Threaded
Open this post in threaded view
|  
Report Content as Inappropriate

Compiling errors with AMD

lnx-3
uname -a
Linux zux 2.4.28-grsec #7 SMP ke tammikuun 19. 18:13:58 EET 2005 i686 GNU/Linux

cat /proc/cpu*
processor       : 0
vendor_id       : AuthenticAMD
cpu family      : 6
model           : 2
model name      : AMD Athlon(tm) Processor
stepping        : 1
cpu MHz         : 553.884
cache size      : 512 KB
fdiv_bug        : no
hlt_bug         : no
f00f_bug        : no
coma_bug        : no
fpu             : yes
fpu_exception   : yes
cpuid level     : 1
wp              : yes
flags           : fpu vme de pse tsc msr pae mce cx8 sep mtrr pge mca cmov pat pse36 mmx fxsr syscall mmxext 3dnowext 3dnow
bogomips        : 1104.28

cd /usr/src/modules/fuse-2.3.0; ./configure;./make

Making all in kernel
make[1]: Entering directory `/usr/src/modules/fuse-2.3.0/kernel'
gcc -O2 -Wall -Wstrict-prototypes -fno-strict-aliasing -pipe -msoft-float -I/usr/src/linux-2.4.28/include -I. -D__KERNEL__ -DMODULE -D_LOOSE_KERNEL_NAMES -DFUSE_VERSION=\"2.3.0\"  -c dev.c -o dev.o
In file included from /usr/src/linux-2.4.28/include/linux/kernel.h:15,
                 from /usr/src/linux-2.4.28/include/linux/wait.h:13,
                 from /usr/src/linux-2.4.28/include/linux/fs.h:12,
                 from fuse_i.h:47,
                 from dev.c:9:
/usr/src/linux-2.4.28/include/asm/byteorder.h:14: warning: type qualifiers ignored on function return type
/usr/src/linux-2.4.28/include/asm/byteorder.h:30: warning: type qualifiers ignored on function return type
In file included from /usr/src/linux-2.4.28/include/linux/byteorder/little_endian.h:11,
                 from /usr/src/linux-2.4.28/include/asm/byteorder.h:65,
                 from /usr/src/linux-2.4.28/include/linux/kernel.h:15,
                 from /usr/src/linux-2.4.28/include/linux/wait.h:13,
                 from /usr/src/linux-2.4.28/include/linux/fs.h:12,
                 from fuse_i.h:47,
                 from dev.c:9:
/usr/src/linux-2.4.28/include/linux/byteorder/swab.h:160: warning: type qualifiers ignored on function return type
/usr/src/linux-2.4.28/include/linux/byteorder/swab.h:173: warning: type qualifiers ignored on function return type
/usr/src/linux-2.4.28/include/linux/byteorder/swab.h:186: warning: type qualifiers ignored on function return type
/usr/src/linux-2.4.28/include/linux/byteorder/swab.h:200: warning: type qualifiers ignored on function return type
In file included from /usr/src/linux-2.4.28/include/linux/prefetch.h:13,
                 from /usr/src/linux-2.4.28/include/linux/list.h:6,
                 from /usr/src/linux-2.4.28/include/linux/wait.h:14,
                 from /usr/src/linux-2.4.28/include/linux/fs.h:12,
                 from fuse_i.h:47,
                 from dev.c:9:
/usr/src/linux-2.4.28/include/asm/processor.h:75: error: array type has incomplete element type
In file included from /usr/src/linux-2.4.28/include/linux/prefetch.h:13,
                 from /usr/src/linux-2.4.28/include/linux/list.h:6,
                 from /usr/src/linux-2.4.28/include/linux/wait.h:14,
                 from /usr/src/linux-2.4.28/include/linux/fs.h:12,
                 from fuse_i.h:47,
                 from dev.c:9:
/usr/src/linux-2.4.28/include/asm/processor.h:81:1: warning: "cpu_data" redefined
In file included from /usr/src/linux-2.4.28/include/linux/modversions.h:175,
                 from fuse_i.h:37,
                 from dev.c:9:
/usr/src/linux-2.4.28/include/linux/modules/i386_ksyms.ver:92:1: warning: this is the location of the previous definition
In file included from /usr/src/linux-2.4.28/include/linux/wait.h:16,
                 from /usr/src/linux-2.4.28/include/linux/fs.h:12,
                 from fuse_i.h:47,
                 from dev.c:9:
/usr/src/linux-2.4.28/include/linux/spinlock.h:67:1: warning: "atomic_dec_and_lock" redefined
In file included from /usr/src/linux-2.4.28/include/linux/modversions.h:175,
                 from fuse_i.h:37,
                 from dev.c:9:
/usr/src/linux-2.4.28/include/linux/modules/i386_ksyms.ver:128:1: warning: this is the location of the previous definition
In file included from /usr/src/linux-2.4.28/include/linux/ext3_fs_sb.h:20,
                 from /usr/src/linux-2.4.28/include/linux/fs.h:714,
                 from fuse_i.h:47,
                 from dev.c:9:
/usr/src/linux-2.4.28/include/linux/timer.h:30:1: warning: "del_timer_sync" redefined
In file included from /usr/src/linux-2.4.28/include/linux/modversions.h:180,
                 from fuse_i.h:37,
                 from dev.c:9:
/usr/src/linux-2.4.28/include/linux/modules/ksyms.ver:580:1: warning: this is the location of the previous definition
In file included from /usr/src/linux-2.4.28/include/linux/sched.h:23,
                 from /usr/src/linux-2.4.28/include/linux/mm.h:4,
                 from /usr/src/linux-2.4.28/include/linux/pagemap.h:10,
                 from fuse_i.h:69,
                 from dev.c:9:
/usr/src/linux-2.4.28/include/linux/smp.h:80:1: warning: "smp_num_cpus" redefined
In file included from /usr/src/linux-2.4.28/include/linux/modversions.h:175,
                 from fuse_i.h:37,
                 from dev.c:9:
/usr/src/linux-2.4.28/include/linux/modules/i386_ksyms.ver:96:1: warning: this is the location of the previous definition
In file included from /usr/src/linux-2.4.28/include/linux/sched.h:23,
                 from /usr/src/linux-2.4.28/include/linux/mm.h:4,
                 from /usr/src/linux-2.4.28/include/linux/pagemap.h:10,
                 from fuse_i.h:69,
                 from dev.c:9:
/usr/src/linux-2.4.28/include/linux/smp.h:87:1: warning: "smp_call_function" redefined
In file included from /usr/src/linux-2.4.28/include/linux/modversions.h:175,
                 from fuse_i.h:37,
                 from dev.c:9:
/usr/src/linux-2.4.28/include/linux/modules/i386_ksyms.ver:112:1: warning: this is the location of the previous definition
In file included from /usr/src/linux-2.4.28/include/linux/sched.h:23,
                 from /usr/src/linux-2.4.28/include/linux/mm.h:4,
                 from /usr/src/linux-2.4.28/include/linux/pagemap.h:10,
                 from fuse_i.h:69,
                 from dev.c:9:
/usr/src/linux-2.4.28/include/linux/smp.h:88:1: warning: "cpu_online_map" redefined
In file included from /usr/src/linux-2.4.28/include/linux/modversions.h:175,
                 from fuse_i.h:37,
                 from dev.c:9:
/usr/src/linux-2.4.28/include/linux/modules/i386_ksyms.ver:98:1: warning: this is the location of the previous definition
In file included from /usr/src/linux-2.4.28/include/linux/mm.h:4,
                 from /usr/src/linux-2.4.28/include/linux/pagemap.h:10,
                 from fuse_i.h:69,
                 from dev.c:9:
/usr/src/linux-2.4.28/include/linux/sched.h:162:1: warning: "set_cpus_allowed" redefined
In file included from /usr/src/linux-2.4.28/include/linux/modversions.h:180,
                 from fuse_i.h:37,
                 from dev.c:9:
/usr/src/linux-2.4.28/include/linux/modules/ksyms.ver:662:1: warning: this is the location of the previous definition
make[1]: *** [dev.o] Error 1
make[1]: Leaving directory `/usr/src/modules/fuse-2.3.0/kernel'
make: *** [all-recursive] Error 1


Any ideas?

--
Best Regards,
  lnx



-------------------------------------------------------
SF.Net email is sponsored by: Discover Easy Linux Migration Strategies
from IBM. Find simple to follow Roadmaps, straightforward articles,
informative Webcasts and more! Get everything you need to get up to
speed, fast. http://ads.osdn.com/?ad_id=7477&alloc_id=16492&op=click
_______________________________________________
fuse-devel mailing list
[hidden email]
https://lists.sourceforge.net/lists/listinfo/fuse-devel
Loading...